{"text_format":"1","workbook":"xlsx","n_sheets":4,"sheets":["Unique List","data","cal formula","charts"],"not_rendered":{"charts":3,"images":1,"macros":1,"external_links":0,"defined_names":31,"comments":0,"pivot_tables":0},"unopened":[],"bounds":{"document_bytes":16777216,"sheet_cells":100000,"rows_first":2000,"rows_last":500,"rows_between":2000,"halvings":0,"cell_chars":16384,"cell_head_chars":4096},"cells_cut":0,"cells_raw":0,"read":"whole","date_system":"1900"}

{"sheet":"Unique List","index":0,"n_rows":18,"n_cols":13,"rows_kept":18,"cut":false,"hidden":true,"merged":[]}
["Department",null,"Gender",null,"Band",null,"Designation",null,"Physical Location",null,"Reason for Leaving",null,"Status"]
["Finance & Accounts",null,"Male",null,"GRD 03",null,"Assistant Manager ",null,"Bangalore Branch",null,"Personal Reasons",null,"Active"]
["Purchase",null,"Female",null,"GRD 05",null,"Lead",null,"Mumbai Branch",null,"Retrenchment",null,"Passive"]
["Servicing",null,null,null,"GRD 04",null,"Senior Manager",null,"Kolkata Branch",null,"Involuntary Resignation"]
["Information Technology",null,null,null,"GRD 06",null,"Manager",null,"Gurgaon Branch",null,"Growth Prospects"]
["Supply Chain",null,null,null,"GRD 02",null,"Vice President ",null,"Pune Branch",null,"Health Issues"]
["Operations",null,null,null,"GRD 01",null,"Senior Executive ",null,"Delhi Branch",null,"Absconding"]
["Sales",null,null,null,null,null,"Associate",null,"Noida Branch",null,"Terminated"]
["Human Resource",null,null,null,null,null,"Officer",null,"Chennai Branch",null,"Transfer"]
["Marketing",null,null,null,null,null,"Management Trainee",null,"Hyderabad Branch",null,"Terminated "]
["Customer Service",null,null,null,null,null,"Management Trainee ",null,"Goa Branch"]
["All",null,null,null,null,null,null,null,"All"]
[]
[]
["Department",null,null,null,"Location","location_unique"]
{"$rows_left_out":4}
{"sheet":"data","index":1,"n_rows":251,"n_cols":11,"rows_kept":251,"cut":false,"hidden":true,"merged":[]}
["Emp code","Full Name","Gender","Department","Band","Designation","DOJ","Physical Location","Row No","Search Criteria - Department","Search Criteria - Department1"]
[89219,"Sample M1","Male","Finance & Accounts","GRD 03","Assistant Manager ","2007-05-02","Bangalore Branch",{"$f":"ROWS($D$2:D2)","v":1},{"$f":"IF(ISNUMBER(SEARCH('cal formula'!$I$8,Department,1)),data!$I2,\"\")","v":""},{"$f":"IFERROR(SMALL($J$2:$J$251,ROWS($D$2:D2)),\"\")","v":3}]
[90172,"Sample M2","Male","Servicing","GRD 05","Lead","2007-05-05","Bangalore Branch",{"$f":"ROWS($D$2:D3)","v":2},{"$f":"IF(ISNUMBER(SEARCH('cal formula'!$I$8,Department,1)),data!$I3,\"\")","v":""},{"$f":"IFERROR(SMALL($J$2:$J$251,ROWS($D$2:D3)),\"\")","v":6}]
[89220,"Sample F3","Female","Information Technology","GRD 05","Lead","2007-05-05","Kolkata Branch",{"$f":"ROWS($D$2:D4)","v":3},{"$f":"IF(ISNUMBER(SEARCH('cal formula'!$I$8,Department,1)),data!$I4,\"\")","v":3},{"$f":"IFERROR(SMALL($J$2:$J$251,ROWS($D$2:D4)),\"\")","v":30}]
[90046,"Sample F4","Female","Purchase","GRD 05","Senior Manager","2007-07-25","Mumbai Branch",{"$f":"ROWS($D$2:D5)","v":4},{"$f":"IF(ISNUMBER(SEARCH('cal formula'!$I$8,Department,1)),data!$I5,\"\")","v":""},{"$f":"IFERROR(SMALL($J$2:$J$251,ROWS($D$2:D5)),\"\")","v":38}]
[89812,"Sample M21","Male","Purchase","GRD 01","Associate","2007-11-15","Hyderabad Branch",{"$f":"ROWS($D$2:D6)","v":5},{"$f":"IF(ISNUMBER(SEARCH('cal formula'!$I$8,Department,1)),data!$I6,\"\")","v":""},{"$f":"IFERROR(SMALL($J$2:$J$251,ROWS($D$2:D6)),\"\")","v":46}]
[89254,"Sample M31","Male","Information Technology","GRD 04","Manager","2008-05-07","Kolkata Branch",{"$f":"ROWS($D$2:D7)","v":6},{"$f":"IF(ISNUMBER(SEARCH('cal formula'!$I$8,Department,1)),data!$I7,\"\")","v":6},{"$f":"IFERROR(SMALL($J$2:$J$251,ROWS($D$2:D7)),\"\")","v":55}]
[89572,"Sample M34","Male","Purchase","GRD 05","Senior Manager","2008-06-15","Bangalore Branch",{"$f":"ROWS($D$2:D8)","v":7},{"$f":"IF(ISNUMBER(SEARCH('cal formula'!$I$8,Department,1)),data!$I8,\"\")","v":""},{"$f":"IFERROR(SMALL($J$2:$J$251,ROWS($D$2:D8)),\"\")","v":64}]
[90011,"Sample M43","Male","Purchase","GRD 05","Senior Manager","2008-08-27","Mumbai Branch",{"$f":"ROWS($D$2:D9)","v":8},{"$f":"IF(ISNUMBER(SEARCH('cal formula'!$I$8,Department,1)),data!$I9,\"\")","v":""},{"$f":"IFERROR(SMALL($J$2:$J$251,ROWS($D$2:D9)),\"\")","v":78}]
[89804,"Sample M44","Male","Sales","GRD 02","Senior Executive ","2008-09-27","Mumbai Branch",{"$f":"ROWS($D$2:D10)","v":9},{"$f":"IF(ISNUMBER(SEARCH('cal formula'!$I$8,Department,1)),data!$I10,\"\")","v":""},{"$f":"IFERROR(SMALL($J$2:$J$251,ROWS($D$2:D10)),\"\")","v":109}]
[89275,"Sample M45","Male","Operations","GRD 01","Associate","2008-10-02","Pune Branch",{"$f":"ROWS($D$2:D11)","v":10},{"$f":"IF(ISNUMBER(SEARCH('cal formula'!$I$8,Department,1)),data!$I11,\"\")","v":""},{"$f":"IFERROR(SMALL($J$2:$J$251,ROWS($D$2:D11)),\"\")","v":114}]
[89625,"Sample M46","Male","Finance & Accounts","GRD 01","Associate","2008-10-02","Bangalore Branch",{"$f":"ROWS($D$2:D12)","v":11},{"$f":"IF(ISNUMBER(SEARCH('cal formula'!$I$8,Department,1)),data!$I12,\"\")","v":""},{"$f":"IFERROR(SMALL($J$2:$J$251,ROWS($D$2:D12)),\"\")","v":120}]
[90082,"Sample M47","Male","Human Resource","GRD 05","Senior Manager","2008-10-08","Pune Branch",{"$f":"ROWS($D$2:D13)","v":12},{"$f":"IF(ISNUMBER(SEARCH('cal formula'!$I$8,Department,1)),data!$I13,\"\")","v":""},{"$f":"IFERROR(SMALL($J$2:$J$251,ROWS($D$2:D13)),\"\")","v":149}]
[89472,"Sample M49","Male","Servicing","GRD 05","Lead","2008-11-14","Bangalore Branch",{"$f":"ROWS($D$2:D14)","v":13},{"$f":"IF(ISNUMBER(SEARCH('cal formula'!$I$8,Department,1)),data!$I14,\"\")","v":""},{"$f":"IFERROR(SMALL($J$2:$J$251,ROWS($D$2:D14)),\"\")","v":150}]
[90015,"Sample F19","Female","Operations","GRD 01","Associate","2008-12-16","Kolkata Branch",{"$f":"ROWS($D$2:D15)","v":14},{"$f":"IF(ISNUMBER(SEARCH('cal formula'!$I$8,Department,1)),data!$I15,\"\")","v":""},{"$f":"IFERROR(SMALL($J$2:$J$251,ROWS($D$2:D15)),\"\")","v":179}]
{"$rows_left_out":237}
{"sheet":"cal formula","index":2,"n_rows":251,"n_cols":18,"rows_kept":251,"cut":false,"hidden":true,"merged":[[5,7,5,8]]}
["Full_Name","Department","Physical_Location","Band","Designation","Gender"]
[{"$f":"IF($I$8= \"All\", INDEX(data!$A$2:$H$251,,COLUMN(INDIRECT('cal formula'!A$1))),IFERROR(INDEX(data!$A$2:$H$251,data!$K2,COLUMN(INDIRECT('cal formula'!A$1))),\"\"))","v":"Sample F3"},{"$f":"IF($I$8= \"All\", INDEX(data!$A$2:$H$251,,COLUMN(INDIRECT('cal formula'!B$1))),IFERROR(INDEX(data!$A$2:$H$251,data!$K2,COLUMN(INDIRECT('cal formula'!B$1))),\"\"))","v":"Information Technology"},{"$f":"IF($I$8= \"All\", INDEX(data!$A$2:$H$251,,COLUMN(INDIRECT('cal formula'!C$1))),IFERROR(INDEX(data!$A$2:$H$251,data!$K2,COLUMN(INDIRECT('cal formula'!C$1))),\"\"))","v":"Kolkata Branch"},{"$f":"IF($I$8= \"All\", INDEX(data!$A$2:$H$251,,COLUMN(INDIRECT('cal formula'!D$1))),IFERROR(INDEX(data!$A$2:$H$251,data!$K2,COLUMN(INDIRECT('cal formula'!D$1))),\"\"))","v":"GRD 05"},{"$f":"IF($I$8= \"All\", INDEX(data!$A$2:$H$251,,COLUMN(INDIRECT('cal formula'!E$1))),IFERROR(INDEX(data!$A$2:$H$251,data!$K2,COLUMN(INDIRECT('cal formula'!E$1))),\"\"))","v":"Lead"},{"$f":"IF($I$8= \"All\", INDEX(data!$A$2:$H$251,,COLUMN(INDIRECT('cal formula'!F$1))),IFERROR(INDEX(data!$A$2:$H$251,data!$K2,COLUMN(INDIRECT('cal formula'!F$1))),\"\"))","v":"Female"},null,"Combo Box Linked Cell",1]
[{"$f":"IF($I$8= \"All\", INDEX(data!$A$2:$H$251,,COLUMN(INDIRECT('cal formula'!A$1))),IFERROR(INDEX(data!$A$2:$H$251,data!$K3,COLUMN(INDIRECT('cal formula'!A$1))),\"\"))","v":"Sample M31"},{"$f":"IF($I$8= \"All\", INDEX(data!$A$2:$H$251,,COLUMN(INDIRECT('cal formula'!B$1))),IFERROR(INDEX(data!$A$2:$H$251,data!$K3,COLUMN(INDIRECT('cal formula'!B$1))),\"\"))","v":"Information Technology"},{"$f":"IF($I$8= \"All\", INDEX(data!$A$2:$H$251,,COLUMN(INDIRECT('cal formula'!C$1))),IFERROR(INDEX(data!$A$2:$H$251,data!$K3,COLUMN(INDIRECT('cal formula'!C$1))),\"\"))","v":"Kolkata Branch"},{"$f":"IF($I$8= \"All\", INDEX(data!$A$2:$H$251,,COLUMN(INDIRECT('cal formula'!D$1))),IFERROR(INDEX(data!$A$2:$H$251,data!$K3,COLUMN(INDIRECT('cal formula'!D$1))),\"\"))","v":"GRD 04"},{"$f":"IF($I$8= \"All\", INDEX(data!$A$2:$H$251,,COLUMN(INDIRECT('cal formula'!E$1))),IFERROR(INDEX(data!$A$2:$H$251,data!$K3,COLUMN(INDIRECT('cal formula'!E$1))),\"\"))","v":"Manager"},{"$f":"IF($I$8= \"All\", INDEX(data!$A$2:$H$251,,COLUMN(INDIRECT('cal formula'!F$1))),IFERROR(INDEX(data!$A$2:$H$251,data!$K3,COLUMN(INDIRECT('cal formula'!F$1))),\"\"))","v":"Male"},null,"Value ",{"$f":"INDEX('Unique List'!$E$15:$E$16,'cal formula'!$I$2)","v":"Location"}]
[{"$f":"IF($I$8= \"All\", INDEX(data!$A$2:$H$251,,COLUMN(INDIRECT('cal formula'!A$1))),IFERROR(INDEX(data!$A$2:$H$251,data!$K4,COLUMN(INDIRECT('cal formula'!A$1))),\"\"))","v":"Sample F36"},{"$f":"IF($I$8= \"All\", INDEX(data!$A$2:$H$251,,COLUMN(INDIRECT('cal formula'!B$1))),IFERROR(INDEX(data!$A$2:$H$251,data!$K4,COLUMN(INDIRECT('cal formula'!B$1))),\"\"))","v":"Information Technology"},{"$f":"IF($I$8= \"All\", INDEX(data!$A$2:$H$251,,COLUMN(INDIRECT('cal formula'!C$1))),IFERROR(INDEX(data!$A$2:$H$251,data!$K4,COLUMN(INDIRECT('cal formula'!C$1))),\"\"))","v":"Kolkata Branch"},{"$f":"IF($I$8= \"All\", INDEX(data!$A$2:$H$251,,COLUMN(INDIRECT('cal formula'!D$1))),IFERROR(INDEX(data!$A$2:$H$251,data!$K4,COLUMN(INDIRECT('cal formula'!D$1))),\"\"))","v":"GRD 06"},{"$f":"IF($I$8= \"All\", INDEX(data!$A$2:$H$251,,COLUMN(INDIRECT('cal formula'!E$1))),IFERROR(INDEX(data!$A$2:$H$251,data!$K4,COLUMN(INDIRECT('cal formula'!E$1))),\"\"))","v":"Vice President "},{"$f":"IF($I$8= \"All\", INDEX(data!$A$2:$H$251,,COLUMN(INDIRECT('cal formula'!F$1))),IFERROR(INDEX(data!$A$2:$H$251,data!$K4,COLUMN(INDIRECT('cal formula'!F$1))),\"\"))","v":"Female"},null,"Named Range",{"$f":"INDEX('Unique List'!$F$15:$F$16,'cal formula'!$I$2)","v":"location_unique"}]
[{"$f":"IF($I$8= \"All\", INDEX(data!$A$2:$H$251,,COLUMN(INDIRECT('cal formula'!A$1))),IFERROR(INDEX(data!$A$2:$H$251,data!$K5,COLUMN(INDIRECT('cal formula'!A$1))),\"\"))","v":"Sample M110"},{"$f":"IF($I$8= \"All\", INDEX(data!$A$2:$H$251,,COLUMN(INDIRECT('cal formula'!B$1))),IFERROR(INDEX(data!$A$2:$H$251,data!$K5,COLUMN(INDIRECT('cal formula'!B$1))),\"\"))","v":"Information Technology"},{"$f":"IF($I$8= \"All\", INDEX(data!$A$2:$H$251,,COLUMN(INDIRECT('cal formula'!C$1))),IFERROR(INDEX(data!$A$2:$H$251,data!$K5,COLUMN(INDIRECT('cal formula'!C$1))),\"\"))","v":"Mumbai Branch"},{"$f":"IF($I$8= \"All\", INDEX(data!$A$2:$H$251,,COLUMN(INDIRECT('cal formula'!D$1))),IFERROR(INDEX(data!$A$2:$H$251,data!$K5,COLUMN(INDIRECT('cal formula'!D$1))),\"\"))","v":"GRD 03"},{"$f":"IF($I$8= \"All\", INDEX(data!$A$2:$H$251,,COLUMN(INDIRECT('cal formula'!E$1))),IFERROR(INDEX(data!$A$2:$H$251,data!$K5,COLUMN(INDIRECT('cal formula'!E$1))),\"\"))","v":"Assistant Manager "},{"$f":"IF($I$8= \"All\", INDEX(data!$A$2:$H$251,,COLUMN(INDIRECT('cal formula'!F$1))),IFERROR(INDEX(data!$A$2:$H$251,data!$K5,COLUMN(INDIRECT('cal formula'!F$1))),\"\"))","v":"Male"}]
[{"$f":"IF($I$8= \"All\", INDEX(data!$A$2:$H$251,,COLUMN(INDIRECT('cal formula'!A$1))),IFERROR(INDEX(data!$A$2:$H$251,data!$K6,COLUMN(INDIRECT('cal formula'!A$1))),\"\"))","v":"Sample M146"},{"$f":"IF($I$8= \"All\", INDEX(data!$A$2:$H$251,,COLUMN(INDIRECT('cal formula'!B$1))),IFERROR(INDEX(data!$A$2:$H$251,data!$K6,COLUMN(INDIRECT('cal formula'!B$1))),\"\"))","v":"Information Technology"},{"$f":"IF($I$8= \"All\", INDEX(data!$A$2:$H$251,,COLUMN(INDIRECT('cal formula'!C$1))),IFERROR(INDEX(data!$A$2:$H$251,data!$K6,COLUMN(INDIRECT('cal formula'!C$1))),\"\"))","v":"Noida Branch"},{"$f":"IF($I$8= \"All\", INDEX(data!$A$2:$H$251,,COLUMN(INDIRECT('cal formula'!D$1))),IFERROR(INDEX(data!$A$2:$H$251,data!$K6,COLUMN(INDIRECT('cal formula'!D$1))),\"\"))","v":"GRD 05"},{"$f":"IF($I$8= \"All\", INDEX(data!$A$2:$H$251,,COLUMN(INDIRECT('cal formula'!E$1))),IFERROR(INDEX(data!$A$2:$H$251,data!$K6,COLUMN(INDIRECT('cal formula'!E$1))),\"\"))","v":"Senior Manager"},{"$f":"IF($I$8= \"All\", INDEX(data!$A$2:$H$251,,COLUMN(INDIRECT('cal formula'!F$1))),IFERROR(INDEX(data!$A$2:$H$251,data!$K6,COLUMN(INDIRECT('cal formula'!F$1))),\"\"))","v":"Male"},null,"Sub Category"]
[{"$f":"IF($I$8= \"All\", INDEX(data!$A$2:$H$251,,COLUMN(INDIRECT('cal formula'!A$1))),IFERROR(INDEX(data!$A$2:$H$251,data!$K7,COLUMN(INDIRECT('cal formula'!A$1))),\"\"))","v":"Sample M205"},{"$f":"IF($I$8= \"All\", INDEX(data!$A$2:$H$251,,COLUMN(INDIRECT('cal formula'!B$1))),IFERROR(INDEX(data!$A$2:$H$251,data!$K7,COLUMN(INDIRECT('cal formula'!B$1))),\"\"))","v":"Information Technology"},{"$f":"IF($I$8= \"All\", INDEX(data!$A$2:$H$251,,COLUMN(INDIRECT('cal formula'!C$1))),IFERROR(INDEX(data!$A$2:$H$251,data!$K7,COLUMN(INDIRECT('cal formula'!C$1))),\"\"))","v":"Noida Branch"},{"$f":"IF($I$8= \"All\", INDEX(data!$A$2:$H$251,,COLUMN(INDIRECT('cal formula'!D$1))),IFERROR(INDEX(data!$A$2:$H$251,data!$K7,COLUMN(INDIRECT('cal formula'!D$1))),\"\"))","v":"GRD 03"},{"$f":"IF($I$8= \"All\", INDEX(data!$A$2:$H$251,,COLUMN(INDIRECT('cal formula'!E$1))),IFERROR(INDEX(data!$A$2:$H$251,data!$K7,COLUMN(INDIRECT('cal formula'!E$1))),\"\"))","v":"Assistant Manager "},{"$f":"IF($I$8= \"All\", INDEX(data!$A$2:$H$251,,COLUMN(INDIRECT('cal formula'!F$1))),IFERROR(INDEX(data!$A$2:$H$251,data!$K7,COLUMN(INDIRECT('cal formula'!F$1))),\"\"))","v":"Male"},null,"Combo Box Linked Cell",4]
[{"$f":"IF($I$8= \"All\", INDEX(data!$A$2:$H$251,,COLUMN(INDIRECT('cal formula'!A$1))),IFERROR(INDEX(data!$A$2:$H$251,data!$K8,COLUMN(INDIRECT('cal formula'!A$1))),\"\"))","v":"Sample M252"},{"$f":"IF($I$8= \"All\", INDEX(data!$A$2:$H$251,,COLUMN(INDIRECT('cal formula'!B$1))),IFERROR(INDEX(data!$A$2:$H$251,data!$K8,COLUMN(INDIRECT('cal formula'!B$1))),\"\"))","v":"Information Technology"},{"$f":"IF($I$8= \"All\", INDEX(data!$A$2:$H$251,,COLUMN(INDIRECT('cal formula'!C$1))),IFERROR(INDEX(data!$A$2:$H$251,data!$K8,COLUMN(INDIRECT('cal formula'!C$1))),\"\"))","v":"Pune Branch"},{"$f":"IF($I$8= \"All\", INDEX(data!$A$2:$H$251,,COLUMN(INDIRECT('cal formula'!D$1))),IFERROR(INDEX(data!$A$2:$H$251,data!$K8,COLUMN(INDIRECT('cal formula'!D$1))),\"\"))","v":"GRD 01"},{"$f":"IF($I$8= \"All\", INDEX(data!$A$2:$H$251,,COLUMN(INDIRECT('cal formula'!E$1))),IFERROR(INDEX(data!$A$2:$H$251,data!$K8,COLUMN(INDIRECT('cal formula'!E$1))),\"\"))","v":"Associate"},{"$f":"IF($I$8= \"All\", INDEX(data!$A$2:$H$251,,COLUMN(INDIRECT('cal formula'!F$1))),IFERROR(INDEX(data!$A$2:$H$251,data!$K8,COLUMN(INDIRECT('cal formula'!F$1))),\"\"))","v":"Male"},null,"Value ",{"$f":"INDEX(department_unique,'cal formula'!$I$7)","v":"Information Technology"}]
[{"$f":"IF($I$8= \"All\", INDEX(data!$A$2:$H$251,,COLUMN(INDIRECT('cal formula'!A$1))),IFERROR(INDEX(data!$A$2:$H$251,data!$K9,COLUMN(INDIRECT('cal formula'!A$1))),\"\"))","v":"Sample F114"},{"$f":"IF($I$8= \"All\", INDEX(data!$A$2:$H$251,,COLUMN(INDIRECT('cal formula'!B$1))),IFERROR(INDEX(data!$A$2:$H$251,data!$K9,COLUMN(INDIRECT('cal formula'!B$1))),\"\"))","v":"Information Technology"},{"$f":"IF($I$8= \"All\", INDEX(data!$A$2:$H$251,,COLUMN(INDIRECT('cal formula'!C$1))),IFERROR(INDEX(data!$A$2:$H$251,data!$K9,COLUMN(INDIRECT('cal formula'!C$1))),\"\"))","v":"Pune Branch"},{"$f":"IF($I$8= \"All\", INDEX(data!$A$2:$H$251,,COLUMN(INDIRECT('cal formula'!D$1))),IFERROR(INDEX(data!$A$2:$H$251,data!$K9,COLUMN(INDIRECT('cal formula'!D$1))),\"\"))","v":"GRD 02"},{"$f":"IF($I$8= \"All\", INDEX(data!$A$2:$H$251,,COLUMN(INDIRECT('cal formula'!E$1))),IFERROR(INDEX(data!$A$2:$H$251,data!$K9,COLUMN(INDIRECT('cal formula'!E$1))),\"\"))","v":"Senior Executive "},{"$f":"IF($I$8= \"All\", INDEX(data!$A$2:$H$251,,COLUMN(INDIRECT('cal formula'!F$1))),IFERROR(INDEX(data!$A$2:$H$251,data!$K9,COLUMN(INDIRECT('cal formula'!F$1))),\"\"))","v":"Female"}]
[{"$f":"IF($I$8= \"All\", INDEX(data!$A$2:$H$251,,COLUMN(INDIRECT('cal formula'!A$1))),IFERROR(INDEX(data!$A$2:$H$251,data!$K10,COLUMN(INDIRECT('cal formula'!A$1))),\"\"))","v":"Sample M335"},{"$f":"IF($I$8= \"All\", INDEX(data!$A$2:$H$251,,COLUMN(INDIRECT('cal formula'!B$1))),IFERROR(INDEX(data!$A$2:$H$251,data!$K10,COLUMN(INDIRECT('cal formula'!B$1))),\"\"))","v":"Information Technology"},{"$f":"IF($I$8= \"All\", INDEX(data!$A$2:$H$251,,COLUMN(INDIRECT('cal formula'!C$1))),IFERROR(INDEX(data!$A$2:$H$251,data!$K10,COLUMN(INDIRECT('cal formula'!C$1))),\"\"))","v":"Pune Branch"},{"$f":"IF($I$8= \"All\", INDEX(data!$A$2:$H$251,,COLUMN(INDIRECT('cal formula'!D$1))),IFERROR(INDEX(data!$A$2:$H$251,data!$K10,COLUMN(INDIRECT('cal formula'!D$1))),\"\"))","v":"GRD 01"},{"$f":"IF($I$8= \"All\", INDEX(data!$A$2:$H$251,,COLUMN(INDIRECT('cal formula'!E$1))),IFERROR(INDEX(data!$A$2:$H$251,data!$K10,COLUMN(INDIRECT('cal formula'!E$1))),\"\"))","v":"Associate"},{"$f":"IF($I$8= \"All\", INDEX(data!$A$2:$H$251,,COLUMN(INDIRECT('cal formula'!F$1))),IFERROR(INDEX(data!$A$2:$H$251,data!$K10,COLUMN(INDIRECT('cal formula'!F$1))),\"\"))","v":"Male"}]
[{"$f":"IF($I$8= \"All\", INDEX(data!$A$2:$H$251,,COLUMN(INDIRECT('cal formula'!A$1))),IFERROR(INDEX(data!$A$2:$H$251,data!$K11,COLUMN(INDIRECT('cal formula'!A$1))),\"\"))","v":"Sample F137"},{"$f":"IF($I$8= \"All\", INDEX(data!$A$2:$H$251,,COLUMN(INDIRECT('cal formula'!B$1))),IFERROR(INDEX(data!$A$2:$H$251,data!$K11,COLUMN(INDIRECT('cal formula'!B$1))),\"\"))","v":"Information Technology"},{"$f":"IF($I$8= \"All\", INDEX(data!$A$2:$H$251,,COLUMN(INDIRECT('cal formula'!C$1))),IFERROR(INDEX(data!$A$2:$H$251,data!$K11,COLUMN(INDIRECT('cal formula'!C$1))),\"\"))","v":"Mumbai Branch"},{"$f":"IF($I$8= \"All\", INDEX(data!$A$2:$H$251,,COLUMN(INDIRECT('cal formula'!D$1))),IFERROR(INDEX(data!$A$2:$H$251,data!$K11,COLUMN(INDIRECT('cal formula'!D$1))),\"\"))","v":"GRD 03"},{"$f":"IF($I$8= \"All\", INDEX(data!$A$2:$H$251,,COLUMN(INDIRECT('cal formula'!E$1))),IFERROR(INDEX(data!$A$2:$H$251,data!$K11,COLUMN(INDIRECT('cal formula'!E$1))),\"\"))","v":"Assistant Manager "},{"$f":"IF($I$8= \"All\", INDEX(data!$A$2:$H$251,,COLUMN(INDIRECT('cal formula'!F$1))),IFERROR(INDEX(data!$A$2:$H$251,data!$K11,COLUMN(INDIRECT('cal formula'!F$1))),\"\"))","v":"Female"},null,null,{"$f":"I12&\" \"&\"employees\"","v":"16 employees"},null,null,null,null,"Location Based Count"]
[{"$f":"IF($I$8= \"All\", INDEX(data!$A$2:$H$251,,COLUMN(INDIRECT('cal formula'!A$1))),IFERROR(INDEX(data!$A$2:$H$251,data!$K12,COLUMN(INDIRECT('cal formula'!A$1))),\"\"))","v":"Sample M345"},{"$f":"IF($I$8= \"All\", INDEX(data!$A$2:$H$251,,COLUMN(INDIRECT('cal formula'!B$1))),IFERROR(INDEX(data!$A$2:$H$251,data!$K12,COLUMN(INDIRECT('cal formula'!B$1))),\"\"))","v":"Information Technology"},{"$f":"IF($I$8= \"All\", INDEX(data!$A$2:$H$251,,COLUMN(INDIRECT('cal formula'!C$1))),IFERROR(INDEX(data!$A$2:$H$251,data!$K12,COLUMN(INDIRECT('cal formula'!C$1))),\"\"))","v":"Mumbai Branch"},{"$f":"IF($I$8= \"All\", INDEX(data!$A$2:$H$251,,COLUMN(INDIRECT('cal formula'!D$1))),IFERROR(INDEX(data!$A$2:$H$251,data!$K12,COLUMN(INDIRECT('cal formula'!D$1))),\"\"))","v":"GRD 02"},{"$f":"IF($I$8= \"All\", INDEX(data!$A$2:$H$251,,COLUMN(INDIRECT('cal formula'!E$1))),IFERROR(INDEX(data!$A$2:$H$251,data!$K12,COLUMN(INDIRECT('cal formula'!E$1))),\"\"))","v":"Senior Executive "},{"$f":"IF($I$8= \"All\", INDEX(data!$A$2:$H$251,,COLUMN(INDIRECT('cal formula'!F$1))),IFERROR(INDEX(data!$A$2:$H$251,data!$K12,COLUMN(INDIRECT('cal formula'!F$1))),\"\"))","v":"Male"},null,"Location Count",{"$f":"SUM(I14:I23)","v":16}]
[{"$f":"IF($I$8= \"All\", INDEX(data!$A$2:$H$251,,COLUMN(INDIRECT('cal formula'!A$1))),IFERROR(INDEX(data!$A$2:$H$251,data!$K13,COLUMN(INDIRECT('cal formula'!A$1))),\"\"))","v":"Sample M375"},{"$f":"IF($I$8= \"All\", INDEX(data!$A$2:$H$251,,COLUMN(INDIRECT('cal formula'!B$1))),IFERROR(INDEX(data!$A$2:$H$251,data!$K13,COLUMN(INDIRECT('cal formula'!B$1))),\"\"))","v":"Information Technology"},{"$f":"IF($I$8= \"All\", INDEX(data!$A$2:$H$251,,COLUMN(INDIRECT('cal formula'!C$1))),IFERROR(INDEX(data!$A$2:$H$251,data!$K13,COLUMN(INDIRECT('cal formula'!C$1))),\"\"))","v":"Mumbai Branch"},{"$f":"IF($I$8= \"All\", INDEX(data!$A$2:$H$251,,COLUMN(INDIRECT('cal formula'!D$1))),IFERROR(INDEX(data!$A$2:$H$251,data!$K13,COLUMN(INDIRECT('cal formula'!D$1))),\"\"))","v":"GRD 02"},{"$f":"IF($I$8= \"All\", INDEX(data!$A$2:$H$251,,COLUMN(INDIRECT('cal formula'!E$1))),IFERROR(INDEX(data!$A$2:$H$251,data!$K13,COLUMN(INDIRECT('cal formula'!E$1))),\"\"))","v":"Senior Executive "},{"$f":"IF($I$8= \"All\", INDEX(data!$A$2:$H$251,,COLUMN(INDIRECT('cal formula'!F$1))),IFERROR(INDEX(data!$A$2:$H$251,data!$K13,COLUMN(INDIRECT('cal formula'!F$1))),\"\"))","v":"Male"},null,"Location Name","Location Nos","rows no","criteria","stack",null,"Location Name","Location Nos",null,"named location name","named location nos"]
[{"$f":"IF($I$8= \"All\", INDEX(data!$A$2:$H$251,,COLUMN(INDIRECT('cal formula'!A$1))),IFERROR(INDEX(data!$A$2:$H$251,data!$K14,COLUMN(INDIRECT('cal formula'!A$1))),\"\"))","v":"Sample M376"},{"$f":"IF($I$8= \"All\", INDEX(data!$A$2:$H$251,,COLUMN(INDIRECT('cal formula'!B$1))),IFERROR(INDEX(data!$A$2:$H$251,data!$K14,COLUMN(INDIRECT('cal formula'!B$1))),\"\"))","v":"Information Technology"},{"$f":"IF($I$8= \"All\", INDEX(data!$A$2:$H$251,,COLUMN(INDIRECT('cal formula'!C$1))),IFERROR(INDEX(data!$A$2:$H$251,data!$K14,COLUMN(INDIRECT('cal formula'!C$1))),\"\"))","v":"Mumbai Branch"},{"$f":"IF($I$8= \"All\", INDEX(data!$A$2:$H$251,,COLUMN(INDIRECT('cal formula'!D$1))),IFERROR(INDEX(data!$A$2:$H$251,data!$K14,COLUMN(INDIRECT('cal formula'!D$1))),\"\"))","v":"GRD 03"},{"$f":"IF($I$8= \"All\", INDEX(data!$A$2:$H$251,,COLUMN(INDIRECT('cal formula'!E$1))),IFERROR(INDEX(data!$A$2:$H$251,data!$K14,COLUMN(INDIRECT('cal formula'!E$1))),\"\"))","v":"Assistant Manager "},{"$f":"IF($I$8= \"All\", INDEX(data!$A$2:$H$251,,COLUMN(INDIRECT('cal formula'!F$1))),IFERROR(INDEX(data!$A$2:$H$251,data!$K14,COLUMN(INDIRECT('cal formula'!F$1))),\"\"))","v":"Male"},null,"Bangalore Branch",{"$f":"IF(COUNTIF($C$2:$C$251,$H14)>=1,COUNTIF($C$2:$C$251,$H14),0)","v":3},{"$f":"ROWS($I$14:I14)","v":1},{"$f":"IF($I14>0,$J14,\"\")","v":1},{"$f":"IFERROR(SMALL($K$14:$K$23,ROWS($J$14:J14)),\"\")","v":1},null,{"$f":"IFERROR(INDEX($H$14:$H$23,$L14,COLUMNS($J$14:J14)),\"\")","v":"Bangalore Branch"},{"$f":"IFERROR(INDEX($I$14:$I$23,$L14,COLUMNS($J$14:J14)),\"\")","v":3},null,{"$f":"$N$14:INDEX($N$14:$N$23,COUNTIF($N$14:$N$23,\"?*\"))","v":"Bangalore Branch"},{"$f":"$O$14:INDEX($O$14:$O$23,COUNTIF($O$14:$O$23,\">0\"))","v":3}]
[{"$f":"IF($I$8= \"All\", INDEX(data!$A$2:$H$251,,COLUMN(INDIRECT('cal formula'!A$1))),IFERROR(INDEX(data!$A$2:$H$251,data!$K15,COLUMN(INDIRECT('cal formula'!A$1))),\"\"))","v":"Sample F159"},{"$f":"IF($I$8= \"All\", INDEX(data!$A$2:$H$251,,COLUMN(INDIRECT('cal formula'!B$1))),IFERROR(INDEX(data!$A$2:$H$251,data!$K15,COLUMN(INDIRECT('cal formula'!B$1))),\"\"))","v":"Information Technology"},{"$f":"IF($I$8= \"All\", INDEX(data!$A$2:$H$251,,COLUMN(INDIRECT('cal formula'!C$1))),IFERROR(INDEX(data!$A$2:$H$251,data!$K15,COLUMN(INDIRECT('cal formula'!C$1))),\"\"))","v":"Bangalore Branch"},{"$f":"IF($I$8= \"All\", INDEX(data!$A$2:$H$251,,COLUMN(INDIRECT('cal formula'!D$1))),IFERROR(INDEX(data!$A$2:$H$251,data!$K15,COLUMN(INDIRECT('cal formula'!D$1))),\"\"))","v":"GRD 02"},{"$f":"IF($I$8= \"All\", INDEX(data!$A$2:$H$251,,COLUMN(INDIRECT('cal formula'!E$1))),IFERROR(INDEX(data!$A$2:$H$251,data!$K15,COLUMN(INDIRECT('cal formula'!E$1))),\"\"))","v":"Senior Executive "},{"$f":"IF($I$8= \"All\", INDEX(data!$A$2:$H$251,,COLUMN(INDIRECT('cal formula'!F$1))),IFERROR(INDEX(data!$A$2:$H$251,data!$K15,COLUMN(INDIRECT('cal formula'!F$1))),\"\"))","v":"Female"},null,"Mumbai Branch",5,{"$f":"ROWS($I$14:I15)","v":2},{"$f":"IF($I15>0,$J15,\"\")","v":2},{"$f":"IFERROR(SMALL($K$14:$K$23,ROWS($J$14:J15)),\"\")","v":2},null,{"$f":"IFERROR(INDEX($H$14:$H$23,$L15,COLUMNS($J$14:J15)),\"\")","v":"Mumbai Branch"},{"$f":"IFERROR(INDEX($I$14:$I$23,$L15,COLUMNS($J$14:J15)),\"\")","v":5}]
{"$rows_left_out":237}
{"sheet":"charts","index":3,"n_rows":4,"n_cols":3,"rows_kept":4,"cut":false,"hidden":false,"merged":[]}
[]
[]
[null,"Department Select"]
[null,"Total employee count",{"$f":"'cal formula'!I11","v":"16 employees"}]